Aposcopolamine

Normal alkane RI, non-polar column, temperature ramp

View large format table.

Column type Active phase I Reference Comment
CapillaryOV-12130.Zayed and Wink, 2004He, 120. C @ 3. min, 8. K/min; Column length: 30. m; Column diameter: 0.25 mm; Tend: 300. C

Normal alkane RI, non-polar column, custom temperature program

View large format table.

Column type Active phase I Reference Comment
CapillarySE-542130.Detzel and Wink, 199315. m/0.25 mm/0.16 μm, Helium; Program: 150 0C (2 min) 15 0C/min -> 250 0C 25 0C/min -> 200 0C (10 min)

References

Zayed and Wink, 2004
Zayed, R.; Wink, M., Induction of tropane alkaloid formation in transformed root cultures of Brugmansia suaveolens (Solanaceae), Z. Naturforsch. C:, 2004, 59, 11-12, 863-867. [all data]

Detzel and Wink, 1993
Detzel, A.; Wink, M., Attraction. deterrence or intoxication of bees (Apis mellifera) by plant allelochemicals, Chemoecology, 1993, 4, 1, 8-18, https://doi.org/10.1007/BF01245891 . [all data]