3α-Tigloyloxytropane

Kovats' RI, non-polar column, temperature ramp

View large format table.

Column type Active phase I Reference Comment
CapillaryDB-11646.Jenett-Siems, Weigl, et al., 2005He, 6. K/min; Column length: 30. m; Column diameter: 0.32 mm; Tstart: 70. C; Tend: 300. C

Normal alkane RI, non-polar column, temperature ramp

View large format table.

Column type Active phase I Reference Comment
CapillaryOV-11643.Zayed and Wink, 2004He, 120. C @ 3. min, 8. K/min; Column length: 30. m; Column diameter: 0.25 mm; Tend: 300. C

References

Jenett-Siems, Weigl, et al., 2005
Jenett-Siems, K.; Weigl, R.; Böhm, A.; Mann, P.; Tofern-Reblin, B.; Ott, S.C.; Ghomian, A.; Kaloga, M.; Siems, K.; Witte, L.; Hilker, M.; Müller, F.; Eich, E., Chemotaxonomy of the pantropical genus Merremia (Convolvulaceae) based on the distribution of tropane alkaloids, Phytochemistry, 2005, 66, 12, 1448-1464, https://doi.org/10.1016/j.phytochem.2005.04.027 . [all data]

Zayed and Wink, 2004
Zayed, R.; Wink, M., Induction of tropane alkaloid formation in transformed root cultures of Brugmansia suaveolens (Solanaceae), Z. Naturforsch. C:, 2004, 59, 11-12, 863-867. [all data]