Piperazine, 1-acetyl-4-(4-chlorophenoxyacetyl)

Kovats' RI, non-polar column, temperature ramp

Data compiled by: NIST Mass Spectrometry Data Center, William E. Wallace, director

Column type Capillary
Active phase HP-1
Column length (m) 12.
Carrier gas He
Substrate
Column diameter (mm) 0.20
Phase thickness (μm) 0.33
Tstart (C) 100.
Tend (C) 310.
Heat rate (K/min) 30.
Initial hold (min) 3.
Final hold (min) 8.
I 2460.
ReferenceStaack and Maurer, 2004
Comment MSDC-RI

References

Staack and Maurer, 2004
Staack, R.F.; Maurer, H.H., Studies on the metabolism and the toxicological analysis of the nootropic drug fipexide in rat urine using gas chromatography-mass spectrometry, J. Chromatogr. B, 2004, 804, 2, 337-343, https://doi.org/10.1016/j.jchromb.2004.01.035 . [all data]