6-Epishyobunone

Van Den Dool and Kratz RI, non-polar column, temperature ramp

View large format table.

Column type Active phase I Reference Comment
CapillaryBP-11480.Gonny, Bradesi, et al., 200450. m/0.22 mm/0.25 μm, 2. K/min, 220. C @ 20. min; Tstart: 60. C

Van Den Dool and Kratz RI, polar column, temperature ramp

View large format table.

Column type Active phase I Reference Comment
CapillaryBP-201854.Gonny, Bradesi, et al., 200450. m/0.22 mm/0.25 μm, 2. K/min, 220. C @ 20. min; Tstart: 60. C

Normal alkane RI, non-polar column, temperature ramp

View large format table.

Column type Active phase I Reference Comment
CapillaryRTX-11482.Paolini, Tomi, et al., 200860. m/0.22 mm/0.25 μm, He, 2. K/min, 230. C @ 35. min; Tstart: 60. C

Normal alkane RI, polar column, temperature ramp

View large format table.

Column type Active phase I Reference Comment
CapillaryRTX-Wax1846.Paolini, Tomi, et al., 200860. m/0.22 mm/0.25 μm, He, 2. K/min, 230. C @ 35. min; Tstart: 60. C

References

Gonny, Bradesi, et al., 2004
Gonny, M.; Bradesi, P.; Casanova, J., Identification of the components of the essential oil from wild Corsican Daucus carota L. using 13C-NMR spectroscopy, Flavour Fragr. J., 2004, 19, 5, 424-433, https://doi.org/10.1002/ffj.1330 . [all data]

Paolini, Tomi, et al., 2008
Paolini, J.; Tomi, P.; Bernardini, A.-F.; Bradesi, P.; Casanova, J.; Kaloustian, J., Detailed analysis of the essential oil from Cistus albidus L. by combination of GC/RI, GC/MS and 13C-NMR spectroscopy, N.Z. J. Agric. Res., 2008, 22, 14, 1270-1278. [all data]