(S)-decan-3-ol

Van Den Dool and Kratz RI, non-polar column, temperature ramp

Data compiled by: NIST Mass Spectrometry Data Center, William E. Wallace, director

Column type Capillary
Active phase BPX-5
Column length (m) 25.
Carrier gas He
Substrate
Column diameter (mm) 0.22
Phase thickness (μm) 0.25
Tstart (C) 50.
Tend (C) 300.
Heat rate (K/min) 5.
Initial hold (min) 5.
Final hold (min)
I 1206.
ReferenceDickschat, Wenzel, et al., 2004
Comment MSDC-RI

References

Dickschat, Wenzel, et al., 2004
Dickschat, J.S.; Wenzel, S.C.; Bode, H.B.; Muller, R.; Schulz, S., Biosynthesis of Volatiles by the Myxobacterium Myxococcus xanthus, ChemBioChem, 2004, 5, 6, 778-787, https://doi.org/10.1002/cbic.200300813 . [all data]