Germacrene 1(10),5-dien-4-ol

Van Den Dool and Kratz RI, non-polar column, temperature ramp

Data compiled by: NIST Mass Spectrometry Data Center, William E. Wallace, director

Column type CapillaryCapillary
Active phase SPB-1SPB-1
Column length (m) 30.30.
Carrier gas HeHe
Substrate
Column diameter (mm) 0.250.2
Phase thickness (μm) 0.250.2
Tstart (C) 70.70.
Tend (C) 220.220.
Heat rate (K/min) 3.3.
Initial hold (min)
Final hold (min) 15.15.
I 1554.1554.
ReferenceAntunes, Sevinate-Pinto, et al., 2004Cavaleiro, Salgueiro, et al., 2004
Comment MSDC-RI MSDC-RI

References

Antunes, Sevinate-Pinto, et al., 2004
Antunes, T.; Sevinate-Pinto, I.; Barroso, J.G.; Cavaleiro, C.; Salgueiro, L.R., Micromorphology of trichomes and composition of essential oil of Teucrium capitatum, Flavour Fragr. J., 2004, 19, 4, 336-340, https://doi.org/10.1002/ffj.1310 . [all data]

Cavaleiro, Salgueiro, et al., 2004
Cavaleiro, C.; Salgueiro, L.R.; Miguel, M.G.; da Cunha, A.P., Analysis by gas chromatography?mass spectrometry of the volatile components of Teucrium lusitanicum and Teucrium algarbiensis, J. Chromatogr. A, 2004, 1033, 1, 187-190, https://doi.org/10.1016/j.chroma.2004.01.005 . [all data]