(-)-Sinularene

Normal alkane RI, non-polar column, temperature ramp

View large format table.

Column type Active phase I Reference Comment
CapillaryHP-51415.Yassa, Akhani, et al., 200330. m/0.25 mm/0.32 μm, He, 60. C @ 30. min, 5. K/min; Tend: 250. C

References

Yassa, Akhani, et al., 2003
Yassa, N.; Akhani, H.; Aqaahmadi, M.; Salimian, M., Essential oils from two endemic species of Apiaceae from Iran, Z. Naturforsch. C:, 2003, 58, 459-463. [all data]