Piperazine, 1-(2-methoxyphenyl)-4-acetyl

Kovats' RI, non-polar column, temperature ramp

Data compiled by: NIST Mass Spectrometry Data Center, William E. Wallace, director

Column type Capillary
Active phase HP-1
Column length (m) 12.
Carrier gas He
Substrate
Column diameter (mm) 0.20
Phase thickness (μm) 0.33
Tstart (C) 100.
Tend (C) 310.
Heat rate (K/min) 30.
Initial hold (min)
Final hold (min)
I 2070.
ReferenceStaack and Maurer, 2003
Comment MSDC-RI

References

Staack and Maurer, 2003
Staack, R.F.; Maurer, H.H., Toxicological detection of the new designer drug 1-(4-methoxyphenyl)piperazine and its metabolites in urine and differentiation from an intake of structurally related medicaments using gas chromatography-mass spectrometry, J. Chromatogr. B, 2003, 798, 2, 333-342, https://doi.org/10.1016/j.jchromb.2003.10.004 . [all data]