Benzyl caffeate, TMS

Van Den Dool and Kratz RI, non-polar column, temperature ramp

View large format table.

Column type Active phase I Reference Comment
CapillaryPE-52740.Isidorov and Vinogorova, 2003He, 5. K/min; Column length: 30. m; Column diameter: 0.25 mm; Tstart: 50. C; Tend: 250. C

References

Isidorov and Vinogorova, 2003
Isidorov, V.A.; Vinogorova, V.T., GC-MS analysis of compounds extracted from buds of Populus balsamifera and Populus nigra, Z. Naturforsch. C:, 2003, 58, 355-360. [all data]