Panamine I

Van Den Dool and Kratz RI, non-polar column, temperature ramp

View large format table.

Column type Active phase I Reference Comment
CapillaryHP-5MS2618.Guimaraes P.R., Jose J., et al., 200330. m/0.25 mm/0.25 μm, He, 4. K/min; Tstart: 70. C; Tend: 300. C

References

Guimaraes P.R., Jose J., et al., 2003
Guimaraes P.R.; Jose J.; Galetti M.; Trigo J.R., Quinolizidine alkaloids in Ormosia arborea seeds inhibit predation but not hoarding by agoutis (Dasyprocta leporina), J. Chem. Ecol., 2003, 29, 5, 1065-1072, https://doi.org/10.1023/A:1023817203748 . [all data]