α-Humulene epoxide

Normal alkane RI, polar column, temperature ramp

Data compiled by: NIST Mass Spectrometry Data Center, William E. Wallace, director

Column type Capillary
Active phase Stabilwax
Column length (m) 30.
Carrier gas H2
Substrate
Column diameter (mm) 0.32
Phase thickness (μm) 0.25
Tstart (C) 60.
Tend (C) 280.
Heat rate (K/min) 10.
Initial hold (min) 5.
Final hold (min) 5.
I 1972.
ReferenceJirovetz L., Buchbauer G., et al., 2001
Comment MSDC-RI

References

Jirovetz L., Buchbauer G., et al., 2001
Jirovetz L.; Buchbauer G.; Shafi P.M.; Rosamma M.K.; Geissler M., Analysis of the composition and aroma of the essential leaf oil of Syzygium travancoricum from South India by GC-FID, GC-MS, and olfactometry. Seasonal changes of composition, Chromatographia Sup., 2001, 53, S1, s372-s374, https://doi.org/10.1007/BF02490359 . [all data]