2-n-Propyl-1,2,3,4-tetrahydro-1-methylquinoline

Normal alkane RI, non-polar column, temperature ramp

View large format table.

Column type Active phase I Reference Comment
CapillaryOptima-51590.Jacquemond-Collet, Bessière, et al., 2001He, 50. C @ 3. min, 3. K/min; Column length: 30. m; Column diameter: 0.2 mm; Tend: 250. C

References

Jacquemond-Collet, Bessière, et al., 2001
Jacquemond-Collet, I.; Bessière, J.-M.; Hannedouche, S.; Bertrand, C.; Fourasté, I.; Moulis, C., Identification of the alkaloids of Galipea officinalis by gas chromatography-mass spectrometry, Phytochem. Anal., 2001, 12, 5, 312-319, https://doi.org/10.1002/pca.594 . [all data]