(Z)-7-pentacosene

Normal alkane RI, non-polar column, temperature ramp

View large format table.

Column type Active phase I Reference Comment
CapillaryDB-12477.Drijfhout and Groot, 200160. m/0.25 mm/0.25 μm, H2, 30. C @ 2. min, 4. K/min, 238. C @ 25. min

Normal alkane RI, polar column, temperature ramp

View large format table.

Column type Active phase I Reference Comment
CapillaryStabilwax2526.Drijfhout and Groot, 200160. m/0.25 mm/0.25 μm, H2, 30. C @ 2. min, 4. K/min, 238. C @ 25. min

References

Drijfhout and Groot, 2001
Drijfhout, F.P.; Groot, A.T., Close-range attraction in Lygocoris pabulinus (L.), J. Chem. Ecol., 2001, 27, 6, 1133-1149, https://doi.org/10.1023/A:1010311928256 . [all data]