Elema-1,11-dien-15-al, epimer a

Normal alkane RI, non-polar column, custom temperature program

Data compiled by: NIST Mass Spectrometry Data Center, William E. Wallace, director

Column type Capillary
Active phase CP Sil 5 CB
Column length (m) 25.
Carrier gas N2
Substrate
Column diameter (mm)
Phase thickness (μm) 0.39
Program not specified
I 1551.
ReferenceWeyerstahl, Marschall, et al., 2000
Comment MSDC-RI

References

Weyerstahl, Marschall, et al., 2000
Weyerstahl, P.; Marschall, H.; Splittgerber, U.; D., 1,7-Cyclogermacra-1(10),4-dien-15-al, a sesquiterpene with a novel skeleton, and other sesquiterpenes from Haitian vetiver oil, Flavour Fragr. J., 2000, 15, 2, 61-83, https://doi.org/10.1002/(SICI)1099-1026(200003/04)15:2<61::AID-FFJ865>3.0.CO;2-S . [all data]