(E)-Isovalencenal [eremophila-1(10),7(11)-dien-12-al

Normal alkane RI, non-polar column, custom temperature program

View large format table.

Column type Active phase I Reference Comment
CapillaryCP Sil 5 CB1800.Weyerstahl, Marschall, et al., 2000N2; Column length: 25. m; Phase thickness: 0.39 μm; Program: not specified

References

Weyerstahl, Marschall, et al., 2000
Weyerstahl, P.; Marschall, H.; Splittgerber, U.; D., 1,7-Cyclogermacra-1(10),4-dien-15-al, a sesquiterpene with a novel skeleton, and other sesquiterpenes from Haitian vetiver oil, Flavour Fragr. J., 2000, 15, 2, 61-83, https://doi.org/10.1002/(SICI)1099-1026(200003/04)15:2<61::AID-FFJ865>3.0.CO;2-S . [all data]