[2,3-2H2]-(E)-2-Octen-1-ol

Van Den Dool and Kratz RI, non-polar column, custom temperature program

View large format table.

Column type Active phase I Reference Comment
CapillaryDB-51169.Lin J.M., Fay L.B., et al., 199930. m/0.32 mm/0.25 μm, He; Program: 20C => 70C/min => 50C => 4C/min => 180C => 10C/min => 240C(10min)

Van Den Dool and Kratz RI, polar column, custom temperature program

View large format table.

Column type Active phase I Reference Comment
CapillaryDB-Wax1615.Lin J.M., Fay L.B., et al., 199930. m/0.32 mm/0.25 μm, He; Program: 20C(1min) => 70C/min => 60C => 6C/min => 180C => 10C/min => 240C(15min)
CapillaryFFAP1617.Lin J.M., Fay L.B., et al., 199930. m/0.32 mm/0.25 μm, He; Program: 20C(2min) => 40C/min => 50C => 4C/min => 150C => 10C/min => 240C(15min)

References

Lin J.M., Fay L.B., et al., 1999
Lin J.M.; Fay L.B.; Welti D.H.; Blank I., Synthesis of trans-4,5-epoxy-(E)-2-decenal and its deuterated analog used for the development of a sensitive and selective quantification method based on isotope dilution assay with negative chemical ionization, Lipids, 1999, 34, 10, 1117-1126, https://doi.org/10.1007/s11745-999-0463-8 . [all data]