ACETYLASPARTIC ACID triTMS

Van Den Dool and Kratz RI, non-polar column, temperature ramp

View large format table.

Column type Active phase I Reference Comment
CapillaryCP Sil 5 CB1680.Halket, Przyborowska, et al., 199925. m/0.15 mm/0.12 μm, 90. C @ 1. min, 10. K/min, 270. C @ 7. min

References

Halket, Przyborowska, et al., 1999
Halket, J.N.; Przyborowska, A.; Stein, S.E.; Mallard, W.G.; Down, S.; Chalmers, R., Deconvolution gas chromatography / mass spectrometry of urinary organic acids - potential for pattern recognition and automated identification of metabolic disorders, Rapid Commun. Mass spectrom., 1999, 13, 4, 279-284, https://doi.org/10.1002/(SICI)1097-0231(19990228)13:4<279::AID-RCM478>3.0.CO;2-I . [all data]