progesterone, MO-TMS, syn

Normal alkane RI, non-polar column, temperature ramp

Data compiled by: NIST Mass Spectrometry Data Center, William E. Wallace, director

Column type Capillary
Active phase DB-5MS
Column length (m) 30.
Carrier gas He
Substrate
Column diameter (mm) 0.25
Phase thickness (μm) 0.25
Tstart (C) 150.
Tend (C) 290.
Heat rate (K/min) 4.
Initial hold (min)
Final hold (min)
I 2907.
ReferenceEechaute, Dhooge, et al., 1999
Comment MSDC-RI

References

Eechaute, Dhooge, et al., 1999
Eechaute, W.P.; Dhooge, W.S.; Gao, C.Q.; Calders, P.; Rubens, R.; Weyne, J.; Kaufman, J.M., Progesterone-transforming enzyme activity in the hypothalamus of the male rat, J. Steroid Biochem. Mol. Biol., 1999, 70, 4-6, 159-167, https://doi.org/10.1016/S0960-0760(99)00106-5 . [all data]