progesterone, MO-TMS, anti

Normal alkane RI, non-polar column, temperature ramp

View large format table.

Column type Active phase I Reference Comment
CapillaryDB-5MS2913.Eechaute, Dhooge, et al., 199930. m/0.25 mm/0.25 μm, He, 4. K/min; Tstart: 150. C; Tend: 290. C

References

Eechaute, Dhooge, et al., 1999
Eechaute, W.P.; Dhooge, W.S.; Gao, C.Q.; Calders, P.; Rubens, R.; Weyne, J.; Kaufman, J.M., Progesterone-transforming enzyme activity in the hypothalamus of the male rat, J. Steroid Biochem. Mol. Biol., 1999, 70, 4-6, 159-167, https://doi.org/10.1016/S0960-0760(99)00106-5 . [all data]