citronellyl geranylate

Van Den Dool and Kratz RI, non-polar column, temperature ramp

View large format table.

Column type Active phase I Reference Comment
CapillaryDB-52117.Ruther, Sieben, et al., 199830. m/0.32 mm/0.25 μm, He, 3. K/min; Tstart: 150. C; Tend: 280. C

References

Ruther, Sieben, et al., 1998
Ruther, J.; Sieben, S.; Schricker, B., Role of cuticular lipids in nestmate recognition of the European hornet Vespa crabro L. (Hymenoptera, Vespidae), Insectes Soc., 1998, 45, 2, 169-179, https://doi.org/10.1007/s000400050077 . [all data]