Butanoic acid, 2,3-dihydroxy-2-methyl, erythro, methyl ester

Kovats' RI, non-polar column, custom temperature program

View large format table.

Column type Active phase I Reference Comment
CapillaryDB-1973.Jenett-Siems, Schimming, et al., 1998Program: not specified

References

Jenett-Siems, Schimming, et al., 1998
Jenett-Siems, K.; Schimming, T.; Kaloga, M.; Eich, E.; Siems, K.; Gupta, M.P.; Witte, L.; Hartmann, T., Pyrrolizidine alkaloids of Ipomoea hederifolia and related species, Phytochemistry, 1998, 47, 8, 1551-1560, https://doi.org/10.1016/S0031-9422(97)01082-0 . [all data]