Methyl salicylate, Gly, TFA

Van Den Dool and Kratz RI, non-polar column, custom temperature program

View large format table.

Column type Active phase I Reference Comment
CapillaryDB-5MS1963.Chassagne, Crouzet, et al., 199830. m/0.25 mm/0.25 μm, He; Program: 125C => 3C/min => 220C => 2C/min => 280C
CapillaryDB-5MS1970.Chassagne, Crouzet, et al., 199830. m/0.25 mm/0.25 μm, He; Program: 125C => 3C/min => 220C => 2C/min => 280C

References

Chassagne, Crouzet, et al., 1998
Chassagne, D.; Crouzet, J.; Bayonove, C.L.; Baumes, R.L., Identification of passion fruit glycosides by gas chromatography/mass spectrometry, J. Agric. Food Chem., 1998, 46, 10, 4352-4357, https://doi.org/10.1021/jf980416k . [all data]