[14C4]GA15 methyl ester TMS ether

Van Den Dool and Kratz RI, non-polar column, custom temperature program

View large format table.

Column type Active phase I Reference Comment
CapillaryBP-12608.MacMillan, Ward, et al., 199725. m/0.2 mm/0.1 μm, He; Program: 60C(2min) => 10C/min => 150C => 3C/min => 300C(10min)

References

MacMillan, Ward, et al., 1997
MacMillan, J.; Ward, D.A.; Phillips, A.L.; Sánchez-Beltrán, M.J.; Gaskin, P.; Lange, T.; Hedden, P., Gibberellin biosynthesis from gibberellin A12-aldehyde in endosperm and embryos of Marah macrocarpus, Plant Physiol., 1997, 113, 4, 1369-1377, https://doi.org/10.1104/pp.113.4.1369 . [all data]