[14C1]GA44 methyl ester

Van Den Dool and Kratz RI, non-polar column, custom temperature program

Data compiled by: NIST Mass Spectrometry Data Center, William E. Wallace, director

Column type Capillary
Active phase BP-1
Column length (m) 25.
Carrier gas He
Substrate
Column diameter (mm) 0.2
Phase thickness (μm) 0.1
Program 60C(2min) => 10C/min => 150C => 3C/min => 300C(10min)
I 2778.
ReferenceMacMillan, Ward, et al., 1997
Comment MSDC-RI

References

MacMillan, Ward, et al., 1997
MacMillan, J.; Ward, D.A.; Phillips, A.L.; Sánchez-Beltrán, M.J.; Gaskin, P.; Lange, T.; Hedden, P., Gibberellin biosynthesis from gibberellin A12-aldehyde in endosperm and embryos of Marah macrocarpus, Plant Physiol., 1997, 113, 4, 1369-1377, https://doi.org/10.1104/pp.113.4.1369 . [all data]