3-Epi-GA, MeTMS

Van Den Dool and Kratz RI, non-polar column, custom temperature program

View large format table.

Column type Active phase I Reference Comment
CapillaryDB-5MS2802.Ben-Cheikh, Perez-Botella, et al., 199730. m/0.25 mm/0.25 μm, He; Program: 50C (1min) =.30C/min => 240C => 10C/min => 280C

References

Ben-Cheikh, Perez-Botella, et al., 1997
Ben-Cheikh, W.; Perez-Botella, J.; Tadeo, F.R.; Talon, M.; Primo-Millo, E., Pollination increases gibberellin levels in developing ovaries of seeded varieties of citrus, Plant Physiol., 1997, 114, 557-564. [all data]