8-Dehydrocholesterol, TMS

Normal alkane RI, non-polar column, temperature ramp

View large format table.

Column type Active phase I Reference Comment
CapillaryCP Sil 5 CB3194.Batta, Salen, et al., 1995He, 100. C @ 2. min, 35. K/min; Column length: 25. m; Column diameter: 0.22 mm; Tend: 265. C

References

Batta, Salen, et al., 1995
Batta, A.K.; Salen, G.; Tint, G.S.; Shefer, S., Identification of 19-nor-5,7,9(10)-cholestatrien-3β-ol in patients with Smith-Lemli-Opitz syndrome, J. Lipid Res., 1995, 36, 2413-2418. [all data]