13-Methyltetratriacontane

Van Den Dool and Kratz RI, non-polar column, temperature ramp

Data compiled by: NIST Mass Spectrometry Data Center, William E. Wallace, director

Column type Capillary
Active phase HT-5
Column length (m) 25.
Carrier gas N2
Substrate
Column diameter (mm) 0.53
Phase thickness (μm) 0.22
Tstart (C) 150.
Tend (C) 320.
Heat rate (K/min) 15.
Initial hold (min)
Final hold (min) 20.
I 3423.
ReferenceGoh S.H., Ooi K.E., et al., 1993
Comment MSDC-RI

References

Goh S.H., Ooi K.E., et al., 1993
Goh S.H.; Ooi K.E.; Chuah C.H.; Yong H.S.; Khoo S.G.; Ong S.H., Cuticular hydrocarbons from two species of Malaysian Bactrocera fruit flies, Biochem. Syst. Ecol., 1993, 21, 2, 215-226, https://doi.org/10.1016/0305-1978(93)90039-T . [all data]