5-Cholenoic acid, 3-β-hydroxy, methyl ester, TMS

Normal alkane RI, non-polar column, temperature ramp

View large format table.

Column type Active phase I Reference Comment
CapillaryMethyl Silicone3192.Ichimiya, Egestad, et al., 199125. m/0.32 mm/0.25 μm, He, 25. K/min; Tstart: 80. C; Tend: 280. C
CapillaryMethyl Silicone3192.Ichimiya, Egestad, et al., 199125. m/0.32 mm/0.25 μm, He, 25. K/min; Tstart: 80. C; Tend: 280. C

Normal alkane RI, non-polar column, custom temperature program

View large format table.

Column type Active phase I Reference Comment
CapillaryUltra-13175.Axelson, Ellis, et al., 200025. m/0.32 mm/0.17 μm, H2; Program: 50 0C (3 min) -> 185 0C 5 K/min -> 280 0C
CapillaryMethyl Silicone3174.Meng, Reyes, et al., 1997Program: not specified
CapillaryMethyl Silicone3172.Meng and Sjövall, 199725. m/0.32 mm/0.25 μm; Program: 60 0C 30 K/min -> 210 0C (1.5 min) 2.5 K/min -> 320 0C (20 min)
CapillaryMethyl Silicone3174.Meng and Sjövall, 199725. m/0.32 mm/0.25 μm; Program: 60 0C 30 K/min -> 210 0C (1.5 min) 2.5 K/min -> 320 0C (20 min)

References

Ichimiya, Egestad, et al., 1991
Ichimiya, H.; Egestad, B.; Nazer, H.; Baginski, E.S.; Clayton, P.T.; Sjövall, J., Bile acids and bile alcohols in a child with hepatic 3β-hydroxy-Δ5-C27-steroid dehydrogenase deficiency: effects of chenodeoxycholic acid treatment, J. Lipid Res., 1991, 32, 829-841. [all data]

Axelson, Ellis, et al., 2000
Axelson, M.; Ellis, E.; Mörk, B.; Garmark, K.; Abrahamsson, A.; Björkhem, I.; Ericzon, B.-G.; Einarsson, C., Bile acid synthesis in cultured human hepatocytes: support for an alternative biosynthetic pathway to cholic acid, Hepatology, 2000, 31, 6, 1305-1312, https://doi.org/10.1053/jhep.2000.7877 . [all data]

Meng, Reyes, et al., 1997
Meng, L.-J.; Reyes, H.; Palma, J.; Hernandez, I.; Ribalta, J.; Sjövall, J., Profiles of bile acids and progesterone metabolites in the urine and serum of women with intrahepatic cholestasis of pregnancy, J. Hepatol., 1997, 27, 2, 346-357, https://doi.org/10.1016/S0168-8278(97)80181-X . [all data]

Meng and Sjövall, 1997
Meng, L.-J.; Sjövall, J., Method for combined analysis of profiles of conjugated progesterone metabolites and bile acids in serum and urine of pregnant women, J. Chromatogr. B, 1997, 688, 1, 11-26, https://doi.org/10.1016/S0378-4347(97)88051-6 . [all data]