VERAPAMIL, M(N-BIS-DESALKYL-), AC

Kovats' RI, non-polar column, temperature ramp

Data compiled by: NIST Mass Spectrometry Data Center, William E. Wallace, director

Column type Packed
Active phase OV-101
Column length (m) 0.60
Carrier gas N2
Substrate Chromosorb G HP
Column diameter (mm)
Phase thickness (μm)
Tstart (C) 100.
Tend (C) 310.
Heat rate (K/min) 30.
Initial hold (min) 3.
Final hold (min) 5.
I 2545.
ReferenceMaurer, 1990
Comment MSDC-RI

References

Maurer, 1990
Maurer, H.H., Identification of antiarrhythmic drugs and their metabolites in urine, Arch. Toxicol., 1990, 64, 3, 218-230, https://doi.org/10.1007/BF02010728 . [all data]