3-(5'-hydroxymethyl-2'-furyl)-2-phenyl-2-propenal

Van Den Dool and Kratz RI, non-polar column, temperature ramp

View large format table.

Column type Active phase I Reference Comment
CapillaryDB-51965.Kunert-Kirchhoff and Baltes, 1990He, 150. C @ 5. min, 2. K/min; Column length: 30. m; Column diameter: 0.25 mm; Tend: 300. C

References

Kunert-Kirchhoff and Baltes, 1990
Kunert-Kirchhoff, J.; Baltes, W., Model reactions on roast arome formation. VII. Specific products of phenylalanine after cooking L-phenylalanine with D-glucose in a laboratory autoclave, Z. Lebensm. Unters. Forsch., 1990, 190, 1, 9-13, https://doi.org/10.1007/BF01188255 . [all data]