trans-carbomethoxy-1,4-dimethylcyclohexane

Kovats' RI, polar column, isothermal

View large format table.

Column type Active phase Temperature (C) I Reference Comment
CapillaryPEG-2000110.1450.7Rudenko, 1983N2; Column length: 50. m; Column diameter: 0.25 mm
CapillaryPEG-2000120.1478.4Rudenko, 1983N2; Column length: 50. m; Column diameter: 0.25 mm
CapillaryPEG-2000130.1489.0Rudenko, 1983N2; Column length: 50. m; Column diameter: 0.25 mm

References

Rudenko, 1983
Rudenko, B.A., Relation of the gas chromatographic retention indexes of isomeric alkylcyclohexenoate esters to their structure and conformation, Izv. Akad. Nauk SSSR Ser. Khim., 1983, 5, 1002-1005. [all data]