5-sec-butyl-2-chloro-3-methylpyrazine

Normal alkane RI, non-polar column, temperature ramp

Data compiled by: NIST Mass Spectrometry Data Center, William E. Wallace, director

Column type Capillary
Active phase OV-101
Column length (m) 50.
Carrier gas N2
Substrate
Column diameter (mm) 0.22
Phase thickness (μm)
Tstart (C) 80.
Tend (C) 200.
Heat rate (K/min) 2.
Initial hold (min)
Final hold (min)
I 1256.
ReferenceMihara and Masuda, 1987
Comment MSDC-RI

References

Mihara and Masuda, 1987
Mihara, S.; Masuda, H., Correlation between molecular structures and retention indices of pyrazines, J. Chromatogr., 1987, 402, 309-317, https://doi.org/10.1016/0021-9673(87)80029-8 . [all data]