3-β,19-Dihydroxy-5-androsten-17-one, MO TMS

Kovats' RI, non-polar column, isothermal

View large format table.

Column type Active phase Temperature (C) I Reference Comment
PackedOV-1235.2705.Smith, Joannou, et al., 1978N2, Gas-Chrom Q (100-120 mesh); Column length: 2.5 m

References

Smith, Joannou, et al., 1978
Smith, A.G.; Joannou, G.E.; Mák, M.; Uwajima, T.; Terada, O.; Brooks, C.J.W., Oxidation of 3β-hydroxyandrostenes by the 3β-hydroxysteroid oxidase (cholesterol oxidase) from Brevibacterium sterolicum prior to their analysis by gas-liquid chromatography-mass spectrometry, J. Chromatogr., 1978, 152, 2, 467-474, https://doi.org/10.1016/S0021-9673(00)85083-9 . [all data]