Methyl 9H-perfluorononanoate

Kovats' RI, non-polar column, isothermal

View large format table.

Column type Active phase Temperature (C) I Reference Comment
PackedOctacosane100.708.Müller, Dietrich, et al., 1978N2, Chromosorb P AW DMCS; Column length: 2.4 m

References

Müller, Dietrich, et al., 1978
Müller, U.; Dietrich, P.; Prescher, D., Gas-chromatographische untersuchungen an perfluor-carbonverbindungen. I. Gas-chromatographische eigenschaften langkettiger perfluorcarbonsäureester, J. Chromatogr., 1978, 147, 31-40, https://doi.org/10.1016/S0021-9673(00)85114-6 . [all data]