Ceramide 20:1/18:0 methaneboronate

Kovats' RI, non-polar column, isothermal

View large format table.

Column type Active phase Temperature (C) I Reference Comment
CapillaryOV-1300.4309.Gaskell and Brooks, 1977He; Column length: 30. m; Column diameter: 0.50 mm

References

Gaskell and Brooks, 1977
Gaskell, S.J.; Brooks, C.J.W., Gas-liquid chromatography-mass spectrometry of phospholipid mixtures after enzymic hydrolysis, J. Chromatogr., 1977, 142, 469-480, https://doi.org/10.1016/S0021-9673(01)92060-6 . [all data]