11α,15α-dihydroxy-9-ketoprosta-5,13-dienoic acid, 19-hydroxy, MO-TMS # 2

Normal alkane RI, non-polar column, temperature ramp

View large format table.

Column type Active phase I Reference Comment
PackedSE-303120.Jonsson, Middleditch, et al., 1976Gas Chrom Q (100-200 mesh), 2. K/min; Column length: 3. m; Tstart: 140. C; Tend: 290. C

References

Jonsson, Middleditch, et al., 1976
Jonsson, H.T., Jr.; Middleditch, B.S.; Schexnayder, M.A.; Desiderio, D.M., 11,15,19-Trihydroxy-9-ketoprost-13-enoic acid and 11,15,19-trihydroxy-9-ketoprosta-5,13-dienoic acid in human seminal fluid, J. Lipid Res., 1976, 17, 1-6. [all data]