11α,15α-dihydroxy-9-ketoprost-13-enoic acid, MO-TMS # 1

Kovats' RI, non-polar column, isothermal

View large format table.

Column type Active phase Temperature (C) I Reference Comment
PackedSE-30200.2860.Jonsson, Middleditch, et al., 1976Gas Chrom Q (100-200 mesh); Column length: 2. m

References

Jonsson, Middleditch, et al., 1976
Jonsson, H.T., Jr.; Middleditch, B.S.; Schexnayder, M.A.; Desiderio, D.M., 11,15,19-Trihydroxy-9-ketoprost-13-enoic acid and 11,15,19-trihydroxy-9-ketoprosta-5,13-dienoic acid in human seminal fluid, J. Lipid Res., 1976, 17, 1-6. [all data]