11α,15α-dihydroxy-9-ketoprost-13-enoic acid, 19-hydroxy, MO-TMS # 1

Normal alkane RI, non-polar column, temperature ramp

Data compiled by: NIST Mass Spectrometry Data Center, William E. Wallace, director

Column type Packed
Active phase SE-30
Column length (m) 3.
Carrier gas
Substrate Gas Chrom Q (100-200 mesh)
Column diameter (mm)
Phase thickness (μm)
Tstart (C) 140.
Tend (C) 290.
Heat rate (K/min) 2.
Initial hold (min)
Final hold (min)
I 3040.
ReferenceJonsson, Middleditch, et al., 1976
Comment MSDC-RI

References

Jonsson, Middleditch, et al., 1976
Jonsson, H.T., Jr.; Middleditch, B.S.; Schexnayder, M.A.; Desiderio, D.M., 11,15,19-Trihydroxy-9-ketoprost-13-enoic acid and 11,15,19-trihydroxy-9-ketoprosta-5,13-dienoic acid in human seminal fluid, J. Lipid Res., 1976, 17, 1-6. [all data]