5-α-Pregnan-3-β,20-β-diol, TMS

Kovats' RI, non-polar column, isothermal

View large format table.

Column type Active phase Temperature (C) I Reference Comment
PackedOV-101207.2820.Berthou, Picart, et al., 1976Column length: 2.1 m
CapillaryOV-101252.2839.Berthou, Picart, et al., 1976Column length: 55. m; Column diameter: 0.37 mm

Normal alkane RI, non-polar column, temperature ramp

View large format table.

Column type Active phase I Reference Comment
PackedSE-302815.Harvey, 1980N2, Gas Chrom Q, 4. K/min; Column length: 2. m; Tstart: 150. C; Tend: 300. C
PackedSE-302815.Harvey, 1977N2, Gas Chrom Q, 2. K/min; Column length: 2.0 m; Tstart: 150. C; Tend: 290. C

Normal alkane RI, non-polar column, custom temperature program

View large format table.

Column type Active phase I Reference Comment
CapillaryPolydimethyl siloxane2862.Vandenheuvel, 1975Program: not specified

References

Berthou, Picart, et al., 1976
Berthou, F.; Picart, D.; Bardou, L.; Floch, H.H., Separation of C19 and C21 dihydroxysteroids by open-hole tubular glass columns and lipophilic gel chromatography, J. Chromatogr., 1976, 118, 2, 135-155, https://doi.org/10.1016/S0021-9673(00)81203-0 . [all data]

Harvey, 1980
Harvey, D.J., Vinyldimethylsilyl ethers as derivative for the characterization of steroids and cannabinoids by gas chromatography mass spectrometry, Biomed. Mass Spectrom., 1980, 7, 5, 211-216, https://doi.org/10.1002/bms.1200070507 . [all data]

Harvey, 1977
Harvey, D.J., Allyldimethylsilyl ethers as derivatives for the characterization of steroids and cannabinoids by combined gas chromatography and mass spectrometry, Biomed. Mass Spectrom., 1977, 4, 4, 265-274, https://doi.org/10.1002/bms.1200040414 . [all data]

Vandenheuvel, 1975
Vandenheuvel, F.A., Gas-liquid chromatographic studies of reactions and structural relationships of steroids, J. Chromatogr., 1975, 103, 1, 113-134, https://doi.org/10.1016/S0021-9673(00)83806-6 . [all data]