5-β-Pregnan-3-β,20-α-diol, TMS

Kovats' RI, non-polar column, isothermal

Data compiled by: NIST Mass Spectrometry Data Center, William E. Wallace, director

Column type PackedCapillary
Active phase OV-101OV-101
Column length (m) 2.155.
Carrier gas
Substrate
Column diameter (mm)  0.37
Phase thickness (μm)
Temperature (C) 207.252.
I 2757.2780.
ReferenceBerthou, Picart, et al., 1976Berthou, Picart, et al., 1976
Comment MSDC-RI MSDC-RI

References

Berthou, Picart, et al., 1976
Berthou, F.; Picart, D.; Bardou, L.; Floch, H.H., Separation of C19 and C21 dihydroxysteroids by open-hole tubular glass columns and lipophilic gel chromatography, J. Chromatogr., 1976, 118, 2, 135-155, https://doi.org/10.1016/S0021-9673(00)81203-0 . [all data]