Melibiose, MO-TMS, minor product

Kovats' RI, non-polar column, isothermal

View large format table.

Column type Active phase Temperature (C) I Reference Comment
CapillaryOV-101272.3010.Adam and Jennings, 1975Column length: 45. m; Column diameter: 0.25 mm

References

Adam and Jennings, 1975
Adam, S.; Jennings, W.G., Gas chromatographic separation of silylated derivatives of disaccharide mixtures on open tubular glass capillary columns, J. Chromatogr., 1975, 115, 1, 218-221, https://doi.org/10.1016/S0021-9673(00)89035-4 . [all data]