Tetrahydro-allo-cortisol enol-TMS

Normal alkane RI, non-polar column, custom temperature program

View large format table.

Column type Active phase I Reference Comment
PackedOV-13154.Chambaz, Defaye, et al., 1973Gas Chrom P; Column length: 2. m; Program: not specified

References

Chambaz, Defaye, et al., 1973
Chambaz, E.M.; Defaye, G.; Madani, C., Trimethyl silyl ether-enol-trimethyl silyl ether - A new type derivative for the gas phase study of hormonal steroids, Anal. Chem., 1973, 45, 7, 1090-1098, https://doi.org/10.1021/ac60329a035 . [all data]