Eicosanoic acid, 20-hydroxy, methyl ester, TMS

Normal alkane RI, non-polar column, temperature ramp

View large format table.

Column type Active phase I Reference Comment
PackedSE-302680.Eglinton, Hunneman, et al., 1968N2, Gas-Chrom Q, 5. K/min; Column length: 3.0 m; Tstart: 100. C; Tend: 260. C

Normal alkane RI, non-polar column, custom temperature program

View large format table.

Column type Active phase I Reference Comment
CapillaryEC-12665.Kallio, Nieminen, et al., 200630. m/0.25 mm/0.25 μm, He; Program: 125C => 10C/min => 205C => 5C/min => 290C (10min)

References

Eglinton, Hunneman, et al., 1968
Eglinton, G.; Hunneman, D.H.; Douraghi-Zadeh, K., Gas chromatographic-mass spectrometric studies of long chain hydroxy acids. II. The hydroxy acids and fatty acids of a 5000-year-old lacustrine sediment, Tetrahedron, 1968, 24, 18, 5929-5941, https://doi.org/10.1016/S0040-4020(01)90979-2 . [all data]

Kallio, Nieminen, et al., 2006
Kallio, H.; Nieminen, R.; Tuomasjukka, S.; Hakala, M., Cutin composition of five Finnish berries, J. Agric. Food Chem., 2006, 54, 2, 457-462, https://doi.org/10.1021/jf0522659 . [all data]