Decanoic acid, 2-hydroxy, methyl ester, TMS

Normal alkane RI, non-polar column, temperature ramp

View large format table.

Column type Active phase I Reference Comment
PackedSE-301538.Eglinton, Hunneman, et al., 1968N2, Gas-Chrom Q, 5. K/min; Column length: 3.0 m; Tstart: 100. C; Tend: 260. C

References

Eglinton, Hunneman, et al., 1968
Eglinton, G.; Hunneman, D.H.; Douraghi-Zadeh, K., Gas chromatographic-mass spectrometric studies of long chain hydroxy acids. II. The hydroxy acids and fatty acids of a 5000-year-old lacustrine sediment, Tetrahedron, 1968, 24, 18, 5929-5941, https://doi.org/10.1016/S0040-4020(01)90979-2 . [all data]