Dibenzo-p-dioxin, 1,2,4,7-tetrachloro

Van Den Dool and Kratz RI, non-polar column, temperature ramp

View large format table.

Column type Active phase I Reference Comment
CapillaryRTX-52305.Donnelly, Munslow, et al., 199130. m/0.25 mm/0.25 μm, He, 170. C @ 1. min, 2. K/min; Tend: 320. C
CapillaryRTX-52305.Donnelly, Munslow, et al., 1991, 230. m/0.25 mm/0.25 μm, He, 170. C @ 1. min, 2. K/min; Tend: 320. C
CapillaryDB-52340.Donnelly, Munslow, et al., 198760. m/0.252 mm/0.25 μm, He, 170. C @ 1. min, 2. K/min; Tend: 340. C

Van Den Dool and Kratz RI, non-polar column, custom temperature program

View large format table.

Column type Active phase I Reference Comment
CapillaryHP-52340.Korhonen and Mantykoski, 198925. m/0.20 mm/0.11 μm, He; Program: 100 0C (1 min) 20 0C/min -> 180 0C 5 0C/min -> 290 0C (until elution of the last peak)

Normal alkane RI, non-polar column, temperature ramp

View large format table.

Column type Active phase I Reference Comment
CapillaryDB-52340.Zhao and Yu, 200760. m/0.25 mm/0.25 μm, He, 170. C @ 1. min, 2. K/min; Tend: 340. C

Normal alkane RI, non-polar column, custom temperature program

View large format table.

Column type Active phase I Reference Comment
CapillaryDB-52340.Lin, Liu, et al., 2002Program: not specified
CapillaryDB-52353.Lin, Liu, et al., 2002Program: not specified
CapillaryDB-52354.Lin, Liu, et al., 2002Program: not specified

References

Donnelly, Munslow, et al., 1991
Donnelly, J.R.; Munslow, W.D.; Grange, A.H.; Pettit, T.L.; Simmons, R.D.; Sovocool, G.W., Correlation of structure with linear retention index for bromo- and bromochlorodibenzo-p-dioxins and bromodibenzofurans, J. Chromatogr., 1991, 540, 293-310, https://doi.org/10.1016/S0021-9673(01)88817-8 . [all data]

Donnelly, Munslow, et al., 1991, 2
Donnelly, J.R.; Munslow, W.D.; Grange, A.H.; Pettit, T.L.; Simmons, R.D.; Kumar, K.S.; Sovocool, G.W., A gas chromatographic/mass spectrometric approach for isomer-specific environmental monitoring of the 1700 bromo-, chloro-, and bromoschloro-dibenzo-p-dioxins, Biol. Mass Spectrom., 1991, 20, 5, 329-337, https://doi.org/10.1002/bms.1200200515 . [all data]

Donnelly, Munslow, et al., 1987
Donnelly, J.R.; Munslow, W.D.; Mitchum, R.K.; Sovocool, G.W., Correlation of structure with rentention index for chlorinated dibenzo-p-dioxins, J. Chromatogr., 1987, 392, 51-63, https://doi.org/10.1016/S0021-9673(01)94253-0 . [all data]

Korhonen and Mantykoski, 1989
Korhonen, I.O.O.; Mantykoski, K.M., Gas-Liquid Chromatographic Analyses. L. Retention, Dispersion and Selectivity Indices of Polychlorinated Dibenzo-p-dioxins and Dibenzofurans, J. Chromatogr., 1989, 477, 2, 327-336, https://doi.org/10.1016/S0021-9673(01)89641-2 . [all data]

Zhao and Yu, 2007
Zhao, J.-S.; Yu, S.-X., Quantitative structure-retention relationship for polychlorinated dibenzodioxins based on molecular interaction fields ...., Chin. J. Anal. Chem., 2007, 35, 12, 1756-1760. [all data]

Lin, Liu, et al., 2002
Lin, Z.; Liu, S.; Li, Z., Molecular modeling of quantitative structure retention relationship studies: retention behavior of polychlorinated dibenzofurans on gas chromatographic stationary phases of varying polarity by a novel molecular distance edge vector, J. Chromatogr. Sci., 2002, 40, 7-13. [all data]