1-Phenylethyl 2-chlorobenzoate

Kovats' RI, non-polar column, isothermal

Data compiled by: NIST Mass Spectrometry Data Center, William E. Wallace, director

Column type CapillaryCapillaryCapillaryCapillaryCapillary
Active phase SE-30SE-30SE-30SE-30SE-30
Column length (m) 25.25.25.25.25.
Carrier gas N2N2N2N2N2
Substrate
Column diameter (mm) 0.330.330.330.330.33
Phase thickness (μm)
Temperature (C) 140.160.180.200.220.
I 1882.1897.1912.1924.1937.
ReferenceKorhonen, 1986Korhonen, 1986Korhonen, 1986Korhonen, 1986Korhonen, 1986
Comment MSDC-RI MSDC-RI MSDC-RI MSDC-RI MSDC-RI
Column type Capillary
Active phase SE-30
Column length (m) 25.
Carrier gas N2
Substrate
Column diameter (mm) 0.33
Phase thickness (μm)
Temperature (C) 240.
I 1949.
ReferenceKorhonen, 1986
Comment MSDC-RI

References

Korhonen, 1986
Korhonen, I.O.O., Gas-Liquid Chromatographic Analyses. XLVIII. Benzyl, (±)-1-Phenylethyl and 2-Phenylethyl Alcohols and the Corresponding Esters of Benzoic Acid and Its 2-, 3- and 4-Chloro, Pentafluoro, 4-Nitro and 3,5-Dinitro Derivatives on SE-30 and OV-351 Capillary Columns, J. Chromatogr., 1986, 363, 277-292. [all data]