7- α-[H]-Silphiperfol-5-ene

Van Den Dool and Kratz RI, non-polar column, temperature ramp

View large format table.

Column type Active phase I Reference Comment
CapillaryRTX-11324.Muselli, Rossi, et al., 200760. m/0.22 mm/0.25 μm, He, 2. K/min, 230. C @ 30. min; Tstart: 60. C
CapillaryRTX-11326.Paolini J., Costa J., et al., 200760. m/0.22 mm/0.25 μm, He, 2. K/min, 230. C @ 35. min; Tstart: 60. C
CapillaryRTX-11326.Paolini, Muselli, et al., 200760. m/0.22 mm/0.25 μm, He, 2. K/min, 230. C @ 35. min; Tstart: 60. C
CapillaryRTX-11326.Paolini, Costa, et al., 200560. m/0.22 mm/0.25 μm, He, 2. K/min, 230. C @ 35. min; Tstart: 60. C

Van Den Dool and Kratz RI, polar column, temperature ramp

View large format table.

Column type Active phase I Reference Comment
CapillaryRTX-Wax1407.Muselli, Rossi, et al., 200760. m/0.22 mm/0.25 μm, He, 2. K/min, 230. C @ 30. min; Tstart: 60. C
CapillaryRTX-Wax1429.Paolini J., Costa J., et al., 200760. m/0.22 mm/0.25 μm, He, 2. K/min, 230. C @ 35. min; Tstart: 60. C
CapillaryRTX-Wax1429.Paolini, Muselli, et al., 200760. m/0.22 mm/0.25 μm, He, 2. K/min, 230. C @ 35. min; Tstart: 60. C
CapillaryRTX-Wax1429.Paolini, Costa, et al., 200560. m/0.22 mm/0.25 μm, He, 2. K/min, 230. C @ 35. min; Tstart: 60. C

Normal alkane RI, non-polar column, temperature ramp

View large format table.

Column type Active phase I Reference Comment
CapillaryVF-5MS1328.Kowalski, 200830. m/0.25 mm/0.25 μm, Helium, 240. C @ 1. min, 20. K/min; Tend: 320. C
CapillaryDB-51328.Kowalski and Wolski, 200530. m/0.25 mm/0.25 μm, 35. C @ 2. min, 4. K/min; Tend: 280. C

References

Muselli, Rossi, et al., 2007
Muselli, A.; Rossi, P.-G.; Desjobert, J.-M.; Bernardini, A.-F.; Berti, L.; Costa, J., Chemical composition and antibacterial activity of Otanthus maritimus (L.) Hoffmanns. Link essential oils from Corsica, Flavour Fragr. J., 2007, 22, 3, 217-223, https://doi.org/10.1002/ffj.1787 . [all data]

Paolini J., Costa J., et al., 2007
Paolini J.; Costa J.; Bernardini A.F., Analysis of the essential oil from the roots of Eupatorium cannabinum subsp corsicum (L.) by GC, GC-MS and C-13-NMR, Phytochem. Anal., 2007, 18, 3, 235-244, https://doi.org/10.1002/pca.977 . [all data]

Paolini, Muselli, et al., 2007
Paolini, J.; Muselli, A.; Bernardini, A.-F.; Bighelli, A.; Casanova, J.; Costa, J., Thymol derivatives from essential oil of Doronicum corsicum L., Flavour Fragr. J., 2007, 22, 6, 479-487, https://doi.org/10.1002/ffj.1824 . [all data]

Paolini, Costa, et al., 2005
Paolini, J.; Costa, J.; Bernardini, A., Analysis of the essential oil from aerial parts of Eupatorium cannabinum subsp. corsicum (L.) by gas chromatography with electron impact and chemical ionization mass spectrometry, J. Chromatogr. A, 2005, 1076, 1-2, 170-178, https://doi.org/10.1016/j.chroma.2005.03.131 . [all data]

Kowalski, 2008
Kowalski, R., Antimicrobial activity of essential oils and extracts of rosinweed (Silphoum trifoliatum and Silphium integrifolium) plants used by the American Indians, Flav. Fragr. J., 2008, 23, 6, 426-433, https://doi.org/10.1002/ffj.1901 . [all data]

Kowalski and Wolski, 2005
Kowalski, R.; Wolski, T., The chemical composition of essential oils of Silphium perfoliatum L., Flavour Fragr. J., 2005, 20, 3, 306-310, https://doi.org/10.1002/ffj.1418 . [all data]