6,6,8,9-tetramethyltricyclo[3.3.3.0]-undec-7-en-2-ol

Normal alkane RI, non-polar column, temperature ramp

View large format table.

Column type Active phase I Reference Comment
CapillaryHP-5MS1580.Gauvin and Smadja, 200530. m/0.25 mm/0.25 μm, He, 60. C @ 30. min, 4. K/min; Tend: 200. C

Normal alkane RI, polar column, temperature ramp

View large format table.

Column type Active phase I Reference Comment
CapillarySupelcowax2109.Gauvin and Smadja, 200560. m/0.2 mm/0.2 μm, He, 60. C @ 30. min, 4. K/min; Tend: 230. C

References

Gauvin and Smadja, 2005
Gauvin, A.; Smadja, J., Essential oil composition of four Psiadia species from Reunion Island: A chemotaxonomic study, Biochem. Syst. Ecol., 2005, 33, 7, 705-714, https://doi.org/10.1016/j.bse.2004.12.013 . [all data]