Allohedycariol

Van Den Dool and Kratz RI, non-polar column, temperature ramp

View large format table.

Column type Active phase I Reference Comment
CapillaryBP-11584.Ferrari, Tomi, et al., 200550. m/0.22 mm/0.25 μm, He, 2. K/min, 220. C @ 20. min; Tstart: 60. C

References

Ferrari, Tomi, et al., 2005
Ferrari, B.; Tomi, F.; Casanova, J., Composition and chemical variability of Ferula communis essential oil from Corsica, Flavour Fragr. J., 2005, 20, 2, 180-185, https://doi.org/10.1002/ffj.1405 . [all data]