5-epi-7-epi-α-Eudesmol

Kovats' RI, non-polar column, temperature ramp

Data compiled by: NIST Mass Spectrometry Data Center, William E. Wallace, director

Column type Capillary
Active phase DB-1
Column length (m) 25.
Carrier gas He
Substrate
Column diameter (mm) 0.2
Phase thickness (μm)
Tstart (C) 60.
Tend (C) 220.
Heat rate (K/min) 3.
Initial hold (min) 3.
Final hold (min)
I 1608.
ReferenceMevy, Bessiere, et al., 2006
Comment MSDC-RI

References

Mevy, Bessiere, et al., 2006
Mevy, J.P.; Bessiere, J.M.; Rabier, J.; Dherbomez, M.; Ruzzier, M.; Millogo, J.; Viano, J., Composition and antimicrobial activities of the essential oil of Triumfetta rhomboidea Jacq., Flavour Fragr. J., 2006, 21, 1, 80-83, https://doi.org/10.1002/ffj.1511 . [all data]